AltME: R3 Building and Porting

Messages

Marco
I surrender so I tried to copy ALL  lib*.dll in c:/minGW/bin to c:/minGW/bin/msys/1.0/bin and it worked !!
Marco
So to summerize it if you have Win7:
Follow hostilefork instructions but:
- download R3-*-console.exe from http://www.rebolsource.net/  and use it as r3-make.exe
- copy ALL lib*.dll from c:/minGW/bin to c:/minGW/bin/msys/1.0/bin
- as the last command use $ make TOOLS=c:/minGW/bin/
good luck! Tell me if you find a shorter/simpler way.

Josh
Max, are you up and running on MSVC?
Maxim
not quite... running around on three projects... a lot of analysis on stone in the last few days.

eFishAnt
Any QT + R3 integration going on?
I would prefer VID + R3
Robert
Why then ask for QT? And, no not that I know about.
Did you try R3-GUI?
eFishAnt
I was for a short time, I will look again...thanks Robert.  and happy New Year!
NickA
eFishAnt, have you tried Marco's http://www.rebol.org/view-script.r?script=vid1r3.r3 ?  It lets you run many R2 VID layouts directly in R3.  You need http://www.rebol.net/builds/#section-2 to use it.

eFishAnt
Thanks I wll do some other experiments.

Arie
Hi, I try to make R3 in Windows 8.1 and get this error:
c:/mingw/bin/../lib/gcc/mingw32/4.7.2/../../../../mingw32/bin/ld.exe: objs/agg_g
raphics.o: bad reloc address 0xc in section `.rdata$_ZTVN3agg33gradient_polymorp
hic_wrapper_baseE[__ZTVN3agg33gradient_polymorphic_wrapper_baseE]'
collect2.exe: error: ld returned 1 exit status
make[1]: *** [r3-view-host] Error 1
make[1]: Leaving directory `/d/work/saphir-master/make'
make: *** [all] Error 2
Any ideas what's wrong?

Arie
Never mind.
I thought the Github sources are the bleeding edge of R3 sources, but that does not seem the case.
Just wanted to get the latest build of R3.
The build on Saphirion website is:
   version         tuple!    2.101.0.3.1
   build           date!     28-Jun-2013/16:18:18
Is there a newer one available?
Cyphre
Arie: the latest public builds of R3/Saphir are always here: http://development.saphirion.com/experimental/builds/
Cyphre
( latest public builds =  'official' builds made by Saphirion)

GregP
I've downloaded the zip archive today from Saphirion/Saphir and tried to build with MSYS.
I get r3.dll and r3-core-host.exe built OK. But didn't compiled r3-view-host.exe OK, here is the error I get:
gcc -o r3-view-host.exe objs/host-main.o objs/host-core.o objs/host-args.o objs/host-device.o objs/host-stdio.o objs/dev-net.o objs/dev-dns.o objs/host-lib.o objs/dev-stdio.o objs/dev-file.o objs/dev-event.o objs/dev-clipboard.o objs/lodepng.o objs/rc4.o objs/aes.o objs/bigint.o objs/rsa.o objs/dh.o
objs/host-view.o objs/host-window.o objs/host-graphics.o objs/host-draw.o objs/host-draw-api.o objs/host-text.o objs/host-text-api.o objs/host-compositor.o objs/host-event.o r3.dll -L. -static-libgcc -lm -lwsock32 -lcomdlg32 -lgdi32 -lmsimg32 -lstdc++ -liphlpapi -Wl,--stack=4194300 -mwindows objs/a
gg_arc.o objs/agg_arrowhead.o objs/agg_bezier_arc.o objs/agg_bspline.o objs/agg_curves.o objs/agg_image_filters.o objs/agg_line_aa_basics.o objs/agg_path_storage.o objs/agg_rasterizer_scanline_aa.o objs/agg_rounded_rect.o objs/agg_sqrt_tables.o objs/agg_trans_affine.o objs/agg_trans_single_path.o ob
js/agg_vcgen_bspline.o objs/agg_vcgen_contour.o objs/agg_vcgen_dash.o objs/agg_vcgen_markers_term.o objs/agg_vcgen_smooth_poly1.o objs/agg_vcgen_stroke.o objs/agg_vpgen_segmentator.o objs/agg_graphics.o objs/agg_font_win32_tt.o objs/agg_truetype_text.o
objs/agg_graphics.o:agg_graphics.cpp:(.text+0x3610): undefined reference to `std::terminate()'
objs/agg_graphics.o:agg_graphics.cpp:(.rdata$_ZTIN3agg33gradient_polymorphic_wrapper_baseE[__ZTIN3agg33gradient_polymorphic_wrapper_baseE]+0x0): undefined reference to `vtable for __cxxabiv1::__class_type_info'
c:/mingw/bin/../lib/gcc/mingw32/4.8.1/../../../../mingw32/bin/ld.exe: objs/agg_graphics.o: bad reloc address 0x0 in section `.rdata$_ZTIN3agg33gradient_polymorphic_wrapper_baseE[__ZTIN3agg33gradient_polymorphic_wrapper_baseE]'
collect2.exe: error: ld returned 1 exit status
make[1]: *** [r3-view-host] Error 1
make[1]: Leaving directory `/c/persokeyfull/rebol3/saphir-master/saphir-master/make'
make: *** [all] Error 2
Any help appreciated!

Arie
@Cyphre thx!

Cyphre
GregP: try to compile all the cpp files and do the final linking with g++ instead of gcc (the next update on github will have the makefile improved)

Last message posted 78 weeks ago.